Target
Tyrosine-protein phosphatase non-receptor type 1
Ligand
BDBM50245846
Substrate
Meas. Tech.
ChEMBL_559402 (CHEMBL1017256)
IC50
27610±n/a nM
Citation
 Lin, LShen, QChen, GRXie, J Beta-C-glycosiduronic acids and beta-C-glycosyl compounds: new PTP1B inhibitors. Bioorg Med Chem Lett 18:6348-51 (2008)  
Target
Name:
Tyrosine-protein phosphatase non-receptor type 1
Synonyms:
PTN1_HUMAN PTPN1 Protein tyrosine phosphatase-1B (PTP1B) Protein-tyrosine phosphatase 1B (PTP1B) Tyrosine-protein phosphatase non-receptor type 1 (PTP1B)
Type:
Protein phosphatase
Mol. Mass.:
49963.76
Organism:
Homo sapiens (Human)
Description:
Human recombinant GST-fusion PTP1B (1-435).
Residue:
435
  
Inhibitor
Name:
BDBM50245846
Synonyms:
(2S,3R,4R,5S,6S)-3,4,5-triacetoxy-6-(3,6-dioxocyclohexa-1,4-dienyl)-tetrahydro-2H-pyran-2-carboxylic acid | CHEMBL518512
Type:
Small organic molecule
Emp. Form.:
C18H18O11
Mol. Mass.:
410.3289
SMILES:
CC(=O)O[C@H]1[C@@H](OC(C)=O)[C@H](O[C@H]([C@@H]1OC(C)=O)C1=CC(=O)C=CC1=O)C(O)=O
: