Target
Tyrosine-protein phosphatase non-receptor type 1
Ligand
BDBM50245900
Substrate
Meas. Tech.
ChEMBL_559402 (CHEMBL1017256)
IC50
770±n/a nM
Citation
 Lin, LShen, QChen, GRXie, J Beta-C-glycosiduronic acids and beta-C-glycosyl compounds: new PTP1B inhibitors. Bioorg Med Chem Lett 18:6348-51 (2008)  
Target
Name:
Tyrosine-protein phosphatase non-receptor type 1
Synonyms:
PTN1_HUMAN PTPN1 Protein tyrosine phosphatase-1B (PTP1B) Protein-tyrosine phosphatase 1B (PTP1B) Tyrosine-protein phosphatase non-receptor type 1 (PTP1B)
Type:
Protein phosphatase
Mol. Mass.:
49963.76
Organism:
Homo sapiens (Human)
Description:
Human recombinant GST-fusion PTP1B (1-435).
Residue:
435
  
Inhibitor
Name:
BDBM50245900
Synonyms:
2-((((2R,3R,4R,5S,6S)-3,4,5-tris(benzoyloxy)-6-(1,4-dimethoxynaphthalen-2-yl)-tetrahydro-2H-pyran-2-yl)methyl)carbamoyl)benzoic acid | CHEMBL492413
Type:
Small organic molecule
Emp. Form.:
C47H39NO12
Mol. Mass.:
809.8121
SMILES:
COc1cc([C@@H]2O[C@H](CNC(=O)c3ccccc3C(O)=O)[C@@H](OC(=O)c3ccccc3)[C@H](OC(=O)c3ccccc3)[C@H]2OC(=O)c2ccccc2)c(OC)c2ccccc12
: