Target
Histone acetyltransferase p300
Ligand
BDBM50265449
Substrate
Meas. Tech.
ChEMBL_558827 (CHEMBL1021613)
Ki
5100±n/a nM
Citation
 Arif, MPradhan, SKThanuja, GRVedamurthy, BMAgrawal, SDasgupta, DKundu, TK Mechanism of p300 specific histone acetyltransferase inhibition by small molecules. J Med Chem 52:267-77 (2009)  
Target
Name:
Histone acetyltransferase p300
Synonyms:
EP300 HIF1A/p300/CREB-binding protein P300
Type:
Protein
Mol. Mass.:
264223.04
Organism:
Homo sapiens (Human)
Description:
Q09472
Residue:
2414
  
Inhibitor
Name:
BDBM50265449
Synonyms:
(1R,3S,9S,11R)-7-(3-Hydroxy-4-methoxy-benzoyl)-4,4,10,10-tetramethyl-3,9,11-tris-(3-methyl-but-2-enyl)-5-oxa-tricyclo[7.3.1.0*1,6*]tridec-6-en-8-one | CHEMBL500215
Type:
Small organic molecule
Emp. Form.:
C39H54O5
Mol. Mass.:
602.8431
SMILES:
[#6]-[#8]-c1ccc(cc1-[#8])-[#6](=O)-[#6]-1=[#6]2-[#8]C([#6])([#6])[#6@@H](-[#6]\[#6]=[#6](\[#6])-[#6])-[#6][C@@]22[#6]-[#6@@H](-[#6]\[#6]=[#6](\[#6])-[#6])C([#6])([#6])[C@]([#6]\[#6]=[#6](\[#6])-[#6])([#6]2)[#6]-1=O
: