Target
Melanocortin receptor 5
Ligand
BDBM50252901
Substrate
Meas. Tech.
ChEMBL_539394 (CHEMBL1027278)
EC50
8.03±n/a nM
Citation
 Proneth, BPogozheva, IDPortillo, FPMosberg, HIHaskell-Luevano, C Melanocortin tetrapeptide Ac-His-DPhe-Arg-Trp-NH2 modified at the para position of the benzyl side chain (DPhe): importance for mouse melanocortin-3 receptor agonist versus antagonist activity. J Med Chem 51:5585-93 (2008)  
Target
Name:
Melanocortin receptor 5
Synonyms:
MC5R_MOUSE Melanocortin receptor 5 | Melanocortin receptor 5 (MC5R)
Type:
Enzyme
Mol. Mass.:
36966.58
Organism:
Mus musculus (Mouse)
Description:
P41149
Residue:
325
  
Inhibitor
Name:
BDBM50252901
Synonyms:
Ac-His-DPhe(pCF3)-Arg-Trp-NH2 | CHEMBL501679
Type:
Small organic molecule
Emp. Form.:
C35H42F3N11O5
Mol. Mass.:
753.7739
SMILES:
CC(=O)N[C@@H](Cc1cnc[nH]1)C(=O)N[C@H](Cc1ccc(cc1)C(F)(F)F)C(=O)N[C@@H](CCCN=C(N)N)C(=O)N[C@@H](Cc1c[nH]c2ccccc12)C(N)=O
: