Target
Melanocyte-stimulating hormone receptor
Ligand
BDBM50252901
Substrate
Meas. Tech.
ChEMBL_539383 (CHEMBL1027267)
EC50
540±n/a nM
Citation
 Proneth, BPogozheva, IDPortillo, FPMosberg, HIHaskell-Luevano, C Melanocortin tetrapeptide Ac-His-DPhe-Arg-Trp-NH2 modified at the para position of the benzyl side chain (DPhe): importance for mouse melanocortin-3 receptor agonist versus antagonist activity. J Med Chem 51:5585-93 (2008)  
Target
Name:
Melanocyte-stimulating hormone receptor
Synonyms:
MC1-R Mc1r Melanocyte-stimulating hormone receptor | Msh-r
Type:
PROTEIN
Mol. Mass.:
35238.60
Organism:
Mus musculus
Description:
ChEMBL_1498846
Residue:
315
  
Inhibitor
Name:
BDBM50252901
Synonyms:
Ac-His-DPhe(pCF3)-Arg-Trp-NH2 | CHEMBL501679
Type:
Small organic molecule
Emp. Form.:
C35H42F3N11O5
Mol. Mass.:
753.7739
SMILES:
CC(=O)N[C@@H](Cc1cnc[nH]1)C(=O)N[C@H](Cc1ccc(cc1)C(F)(F)F)C(=O)N[C@@H](CCCN=C(N)N)C(=O)N[C@@H](Cc1c[nH]c2ccccc12)C(N)=O
: