Target
Melanocortin receptor 3
Ligand
BDBM50252901
Substrate
Meas. Tech.
ChEMBL_539389 (CHEMBL1027273)
Ki
6170±n/a nM
Citation
 Proneth, BPogozheva, IDPortillo, FPMosberg, HIHaskell-Luevano, C Melanocortin tetrapeptide Ac-His-DPhe-Arg-Trp-NH2 modified at the para position of the benzyl side chain (DPhe): importance for mouse melanocortin-3 receptor agonist versus antagonist activity. J Med Chem 51:5585-93 (2008)  
Target
Name:
Melanocortin receptor 3
Synonyms:
MC3-R Mc3r
Type:
PROTEIN
Mol. Mass.:
35808.24
Organism:
Mus musculus
Description:
ChEMBL_1498848
Residue:
323
  
Inhibitor
Name:
BDBM50252901
Synonyms:
Ac-His-DPhe(pCF3)-Arg-Trp-NH2 | CHEMBL501679
Type:
Small organic molecule
Emp. Form.:
C35H42F3N11O5
Mol. Mass.:
753.7739
SMILES:
CC(=O)N[C@@H](Cc1cnc[nH]1)C(=O)N[C@H](Cc1ccc(cc1)C(F)(F)F)C(=O)N[C@@H](CCCN=C(N)N)C(=O)N[C@@H](Cc1c[nH]c2ccccc12)C(N)=O
: