Target
ATP-dependent translocase ABCB1
Ligand
BDBM50293018
Substrate
Meas. Tech.
ChEMBL_518745 (CHEMBL957120)
IC50
>15000±n/a nM
Citation
 Kühnle, MEgger, MMüller, CMahringer, ABernhardt, GFricker, GKönig, BBuschauer, A Potent and selective inhibitors of breast cancer resistance protein (ABCG2) derived from the p-glycoprotein (ABCB1) modulator tariquidar. J Med Chem 52:1190-7 (2009)  
Target
Name:
ATP-dependent translocase ABCB1
Synonyms:
ABCB1 MDR1_HUMAN Multidrug resistance protein 1 P-glycoprotein (P-gp) PGY1
Type:
Protein
Mol. Mass.:
141503.50
Organism:
Homo sapiens (Human)
Description:
P08183
Residue:
1280
  
Inhibitor
Name:
BDBM50293018
Synonyms:
CHEMBL500094 | N-(5-((4-(2-(6,7-Dimethoxy-1,2,3,4-tetrahydroisoquinolin-2-yl)ethyl)phenyl)aminocarbonyl)-2-methylphenyl)quinoline-3-carboxamide
Type:
Small organic molecule
Emp. Form.:
C37H36N4O4
Mol. Mass.:
600.7061
SMILES:
COc1cc2CCN(CCc3ccc(NC(=O)c4ccc(C)c(NC(=O)c5cnc6ccccc6c5)c4)cc3)Cc2cc1OC
: