Target
ATP-dependent translocase ABCB1
Ligand
BDBM50293020
Substrate
Meas. Tech.
ChEMBL_518745 (CHEMBL957120)
IC50
>15000±n/a nM
Citation
 Kühnle, MEgger, MMüller, CMahringer, ABernhardt, GFricker, GKönig, BBuschauer, A Potent and selective inhibitors of breast cancer resistance protein (ABCG2) derived from the p-glycoprotein (ABCB1) modulator tariquidar. J Med Chem 52:1190-7 (2009)  
Target
Name:
ATP-dependent translocase ABCB1
Synonyms:
ABCB1 MDR1_HUMAN Multidrug resistance protein 1 P-glycoprotein (P-gp) PGY1
Type:
Protein
Mol. Mass.:
141503.50
Organism:
Homo sapiens (Human)
Description:
P08183
Residue:
1280
  
Inhibitor
Name:
BDBM50293020
Synonyms:
CHEMBL453516 | N-(3-((4-(2-(6,7-Dimethoxy-1,2,3,4-tetrahydroisoquinolin-2-yl)ethyl)phenyl)aminocarbonyl)-5-methoxyphenyl)quinoline-3-carboxamide
Type:
Small organic molecule
Emp. Form.:
C37H36N4O5
Mol. Mass.:
616.7055
SMILES:
COc1cc(NC(=O)c2cnc3ccccc3c2)cc(c1)C(=O)Nc1ccc(CCN2CCc3cc(OC)c(OC)cc3C2)cc1
: