Target
ATP-dependent translocase ABCB1
Ligand
BDBM50293012
Substrate
Meas. Tech.
ChEMBL_518745 (CHEMBL957120)
IC50
>57000±n/a nM
Citation
 Kühnle, MEgger, MMüller, CMahringer, ABernhardt, GFricker, GKönig, BBuschauer, A Potent and selective inhibitors of breast cancer resistance protein (ABCG2) derived from the p-glycoprotein (ABCB1) modulator tariquidar. J Med Chem 52:1190-7 (2009)  
Target
Name:
ATP-dependent translocase ABCB1
Synonyms:
ABCB1 MDR1_HUMAN Multidrug resistance protein 1 P-glycoprotein (P-gp) PGY1
Type:
Protein
Mol. Mass.:
141503.50
Organism:
Homo sapiens (Human)
Description:
P08183
Residue:
1280
  
Inhibitor
Name:
BDBM50293012
Synonyms:
CHEMBL457439 | Methyl 4-((4-(2-(6,7-dimethoxy-1,2,3,4-tetrahydroisoquinolin-2-yl)ethyl)phenyl)aminocarbonyl)-2-(5-methylpyrazine-2-carbonylamino)benzoate
Type:
Small organic molecule
Emp. Form.:
C34H35N5O6
Mol. Mass.:
609.6716
SMILES:
COC(=O)c1ccc(cc1NC(=O)c1cnc(C)cn1)C(=O)Nc1ccc(CCN2CCc3cc(OC)c(OC)cc3C2)cc1
: