Target
Broad substrate specificity ATP-binding cassette transporter ABCG2
Ligand
BDBM50293018
Substrate
Meas. Tech.
ChEMBL_518478 (CHEMBL938929)
IC50
1990±n/a nM
Citation
 Kühnle, MEgger, MMüller, CMahringer, ABernhardt, GFricker, GKönig, BBuschauer, A Potent and selective inhibitors of breast cancer resistance protein (ABCG2) derived from the p-glycoprotein (ABCB1) modulator tariquidar. J Med Chem 52:1190-7 (2009)  
Target
Name:
Broad substrate specificity ATP-binding cassette transporter ABCG2
Synonyms:
ABCG2 ABCP ATP-binding cassette sub-family G member 2 ATP-binding cassette, sub-family G, member 2 BCRP1 CDw338 Mitoxantrone resistance-associated protein Urate exporter
Type:
Multi-pass membrane protein; monomer or homodimer; disulfide-linked
Mol. Mass.:
72329.48
Organism:
Homo sapiens (Human)
Description:
Q9UNQ0
Residue:
655
  
Inhibitor
Name:
BDBM50293018
Synonyms:
CHEMBL500094 | N-(5-((4-(2-(6,7-Dimethoxy-1,2,3,4-tetrahydroisoquinolin-2-yl)ethyl)phenyl)aminocarbonyl)-2-methylphenyl)quinoline-3-carboxamide
Type:
Small organic molecule
Emp. Form.:
C37H36N4O4
Mol. Mass.:
600.7061
SMILES:
COc1cc2CCN(CCc3ccc(NC(=O)c4ccc(C)c(NC(=O)c5cnc6ccccc6c5)c4)cc3)Cc2cc1OC
: