Target
Peroxisome proliferator-activated receptor gamma
Ligand
BDBM50256108
Substrate
Meas. Tech.
ChEMBL_519279 (CHEMBL947731)
EC50
100±n/a nM
Citation
 Pingali, HJain, MShah, SPatil, PMakadia, PZaware, PSairam, KVJamili, JGoel, APatel, MPatel, P Modulation of PPAR receptor subtype selectivity of the ligands: aliphatic chain vs aromatic ring as a spacer between pharmacophore and the lipophilic moiety. Bioorg Med Chem Lett 18:6471-5 (2008)  
Target
Name:
Peroxisome proliferator-activated receptor gamma
Synonyms:
NR1C3 PPAR-gamma PPARG_HUMAN Peroxisome proliferator-activated receptor gamma (PPAR gamma) Peroxisome proliferator-activated receptor gamma (PPARĪ³) peroxisome proliferator-activated receptor gamma isoform 2
Type:
Nuclear Receptor
Mol. Mass.:
57613.46
Organism:
Homo sapiens (Human)
Description:
P37231
Residue:
505
  
Inhibitor
Name:
BDBM50256108
Synonyms:
4-(6-(5-methyl-2-p-tolyloxazol-4-yl)hexyloxyimino)-4-phenylbutanoic acid | CHEMBL481550
Type:
Small organic molecule
Emp. Form.:
C27H32N2O4
Mol. Mass.:
448.554
SMILES:
Cc1oc(nc1CCCCCCO\N=C(\CCC(O)=O)c1ccccc1)-c1ccc(C)cc1
: