Target
Mitogen-activated protein kinase 14
Ligand
BDBM50265259
Substrate
Meas. Tech.
ChEMBL_497084 (CHEMBL997720)
Ki
11±n/a nM
Citation
 Baldwin, IBamborough, PHaslam, CGHunjan, SSLongstaff, TMooney, CJPatel, SQuinn, JSomers, DO Kinase array design, back to front: biaryl amides. Bioorg Med Chem Lett 18:5285-9 (2008)  
Target
Name:
Mitogen-activated protein kinase 14
Synonyms:
CSAID-binding protein CSBP1 CSPB1 MAP kinase 14 MAP kinase p38 alpha MAPK14 MK14_HUMAN Mitogen-activated protein kinase p38 alpha Stress-activated protein kinase 2a | p38 MAP kinase alpha/beta
Type:
Serine/threonine-protein kinase
Mol. Mass.:
41286.76
Organism:
Homo sapiens (Human)
Description:
Q16539
Residue:
360
  
Inhibitor
Name:
BDBM50265259
Synonyms:
CHEMBL526639 | N-cyclopropyl-3-(isoquinolin-7-yl)-4-methylbenzamide
Type:
Small organic molecule
Emp. Form.:
C20H18N2O
Mol. Mass.:
302.3697
SMILES:
Cc1ccc(cc1-c1ccc2ccncc2c1)C(=O)NC1CC1
: