Target
Serine/threonine-protein kinase Sgk1
Ligand
BDBM50265033
Substrate
Meas. Tech.
ChEMBL_497093 (CHEMBL998571)
IC50
>33000±n/a nM
Citation
 Baldwin, IBamborough, PHaslam, CGHunjan, SSLongstaff, TMooney, CJPatel, SQuinn, JSomers, DO Kinase array design, back to front: biaryl amides. Bioorg Med Chem Lett 18:5285-9 (2008)  
Target
Name:
Serine/threonine-protein kinase Sgk1
Synonyms:
SGK SGK1_HUMAN Serine/threonine-protein kinase Sgk1 (SGK) Serum/glucocorticoid-regulated kinase 1 (SGK1)
Type:
Other Protein Type
Mol. Mass.:
48954.40
Organism:
Homo sapiens (Human)
Description:
Recombinant human SGK-1 enzyme produced in a baculovirus system.
Residue:
431
  
Inhibitor
Name:
BDBM50265033
Synonyms:
CHEMBL522579 | N-cyclopropyl-2',6-dimethyl-4'-(5-methyl-1,3,4-oxadiazol-2-yl)biphenyl-3-carboxamide
Type:
Small organic molecule
Emp. Form.:
C21H21N3O2
Mol. Mass.:
347.4103
SMILES:
Cc1nnc(o1)-c1ccc(c(C)c1)-c1cc(ccc1C)C(=O)NC1CC1
: