Target
11-beta-hydroxysteroid dehydrogenase 1
Ligand
BDBM50248020
Substrate
Meas. Tech.
ChEMBL_543487 (CHEMBL1018653)
IC50
1.6±n/a nM
Citation
 McMinn, DLRew, YSudom, ACaille, SDegraffenreid, MHe, XHungate, RJiang, BJaen, JJulian, LDKaizerman, JNovak, PSun, DTu, HUrsu, SWalker, NPYan, XYe, QWang, ZPowers, JP Optimization of novel di-substituted cyclohexylbenzamide derivatives as potent 11 beta-HSD1 inhibitors. Bioorg Med Chem Lett 19:1446-50 (2009)  
Target
Name:
11-beta-hydroxysteroid dehydrogenase 1
Synonyms:
11-DH 11-beta-Hydroxysteroid Dehydrogenase 1 (11-beta-HSD1) 11-beta-hydroxysteroid dehydrogenase 1 (11HSD1) Corticosteroid 11-beta-dehydrogenase isozyme 1 (11-beta-HSD-1) Corticosteroid 11-beta-dehydrogenase isozyme 1 (11beta-HSD1) HSD11 HSD11L | SDR26C1
Type:
Enzyme
Mol. Mass.:
32409.16
Organism:
Homo sapiens (Human)
Description:
P28845
Residue:
292
  
Inhibitor
Name:
BDBM50248020
Synonyms:
CHEMBL455443 | N-cyclopropyl-N-((1s,4R)-4-(pyridin-3-yl)cyclohexyl)-4-((S)-1,1,1-trifluoro-2-hydroxypropan-2-yl)benzamide
Type:
Small organic molecule
Emp. Form.:
C24H27F3N2O2
Mol. Mass.:
432.4786
SMILES:
C[C@](O)(c1ccc(cc1)C(=O)N(C1CC1)[C@H]1CC[C@H](CC1)c1cccnc1)C(F)(F)F
: