Target
Adenosine receptor A3
Ligand
BDBM50013706
Substrate
Meas. Tech.
ChEMBL_566532 (CHEMBL955118)
Ki
>100000±n/a nM
Citation
 Lambertucci, CAntonini, IBuccioni, MDal Ben, DKachare, DDVolpini, RKlotz, KNCristalli, G 8-Bromo-9-alkyl adenine derivatives as tools for developing new adenosine A2A and A2B receptors ligands. Bioorg Med Chem 17:2812-22 (2009)  
Target
Name:
Adenosine receptor A3
Synonyms:
A3 adenosine receptor (hA3) ADORA3 | Adenosine A3 receptor (A3AR)
Type:
G Protein-Coupled Receptor (GPCR)
Mol. Mass.:
36197.32
Organism:
Homo sapiens (Human)
Description:
P0DMS8
Residue:
318
  
Inhibitor
Name:
BDBM50013706
Synonyms:
9-Benzyl-9H-adenine 9-benzyl-9H-purin-6-amine | CHEMBL266094
Type:
Small organic molecule
Emp. Form.:
C12H11N5
Mol. Mass.:
225.2492
SMILES:
Nc1ncnc2n(Cc3ccccc3)cnc12
: