Target
Mu-type opioid receptor
Ligand
BDBM50266860
Substrate
Meas. Tech.
ChEMBL_563750 (CHEMBL993513)
Ki
123±n/a nM
Citation
 Li, GAschenbach, LCHe, HSelley, DEZhang, Y 14-O-Heterocyclic-substituted naltrexone derivatives as non-peptide mu opioid receptor selective antagonists: design, synthesis, and biological studies. Bioorg Med Chem Lett 19:1825-9 (2009)  
Target
Name:
Mu-type opioid receptor
Synonyms:
M-OR-1 MOR-1 MUOR1 Mu opiate receptor OPRM1 hMOP | mu-type opioid receptor isoform MOR-1
Type:
G Protein-Coupled Receptor (GPCR)
Mol. Mass.:
44789.51
Organism:
Homo sapiens (Human)
Description:
P35372
Residue:
400
  
Inhibitor
Name:
BDBM50266860
Synonyms:
(1S,5R,13R,17S)-4-(cyclopropylmethyl)-10-hydroxy-14-oxo-12-oxa-4-azapentacyclo[9.6.1.0^{1,13}.0^{5,17}.0^{7,18}]octadeca-7(18),8,10-trien-17-yl benzoate | CHEMBL516263
Type:
Small organic molecule
Emp. Form.:
C27H27NO5
Mol. Mass.:
445.507
SMILES:
Oc1ccc2C[C@H]3N(CC4CC4)CC[C@@]45[C@@H](Oc1c24)C(=O)CC[C@@]35OC(=O)c1ccccc1
: