Target
5-hydroxytryptamine receptor 7
Ligand
BDBM50297895
Substrate
Meas. Tech.
ChEMBL_584474 (CHEMBL1059153)
Ki
6±n/a nM
Citation
 Zajdel, PSubra, GVerdie, PGabzdyl, EBojarski, AJDuszynska, BMartinez, JPawlowski, M Sulfonamides with the N-alkyl-N'-dialkylguanidine moiety as 5-HT7 receptor ligands. Bioorg Med Chem Lett 19:4827-31 (2009)  
Target
Name:
5-hydroxytryptamine receptor 7
Synonyms:
5-HT-7 5-HT7 5-HT7S 5HT7 HTR7 | Serotonin receptor 7
Type:
G Protein-Coupled Receptor (GPCR)
Mol. Mass.:
53573.08
Organism:
Homo sapiens (Human)
Description:
P34969
Residue:
479
  
Inhibitor
Name:
BDBM50297895
Synonyms:
4-(2-methoxyphenyl)-N-(N-(naphthalen-1-ylmethyl)carbamimidoyl)piperazine-1-carboxamide | CHEMBL557330
Type:
Small organic molecule
Emp. Form.:
C24H27N5O2
Mol. Mass.:
417.5035
SMILES:
COc1ccccc1N1CCN(CC1)C(=O)NC(N)=NCc1cccc2ccccc12
: