Target
Cathepsin D
Ligand
BDBM50302838
Substrate
Meas. Tech.
ChEMBL_595447 (CHEMBL1045212)
IC50
22±n/a nM
Citation
 Sealy, JMTruong, APTso, LProbst, GDAquino, JHom, RKJagodzinska, BMDressen, DWone, DWBrogley, LJohn, VTung, JSPleiss, MATucker, JAKonradi, AWDappen, MSToth, GPan, HRuslim, LMiller, JBova, MPSinha, SQuinn, KPSauer, JM Design and synthesis of cell potent BACE-1 inhibitors: structure-activity relationship of P1' substituents. Bioorg Med Chem Lett 19:6386-91 (2009)  
Target
Name:
Cathepsin D
Synonyms:
CATD_HUMAN CTSD Cathepsin D heavy chain Cathepsin D precursor
Type:
Enzyme
Mol. Mass.:
44551.72
Organism:
Homo sapiens (Human)
Description:
Human proCathepsin D (SwissProt accession number P07339) was expressed in Sf9 cells, purified, and autoactivated.
Residue:
412
  
Inhibitor
Name:
BDBM50302838
Synonyms:
CHEMBL572081 N-[(1S,2R)-1-(3,5-difluorobenzyl)-2-hydroxy-3-({1-[3-(1H-pyrazol-1-yl)phenyl]cyclohexyl}amino)propyl]acetamide
Type:
Small organic molecule
Emp. Form.:
C27H32F2N4O2
Mol. Mass.:
482.5654
SMILES:
CC(=O)N[C@@H](Cc1cc(F)cc(F)c1)[C@H](O)CNC1(CCCCC1)c1cccc(c1)-n1cccn1
: