Target
Dual specificity mitogen-activated protein kinase kinase 6
Ligand
BDBM31085
Substrate
Meas. Tech.
ChEMBL_587077 (CHEMBL1051289)
Kd
>10000±n/a nM
Citation
 Karaman, MWHerrgard, STreiber, DKGallant, PAtteridge, CECampbell, BTChan, KWCiceri, PDavis, MIEdeen, PTFaraoni, RFloyd, MHunt, JPLockhart, DJMilanov, ZVMorrison, MJPallares, GPatel, HKPritchard, SWodicka, LMZarrinkar, PP A quantitative analysis of kinase inhibitor selectivity. Nat Biotechnol 26:127-32 (2008)  
Target
Name:
Dual specificity mitogen-activated protein kinase kinase 6
Synonyms:
Dual specificity mitogen-activated protein kinase kinase 6 MAP2K6 MAPKK 6 MKK6 Mitogen-activated protein kinase kinase 6 (MKK6) SAPKK3 | SKK3
Type:
Protein
Mol. Mass.:
37494.96
Organism:
Homo sapiens (Human)
Description:
P52564
Residue:
334
  
Inhibitor
Name:
BDBM31085
Synonyms:
1-[4-[(4-ethyl-1-piperazinyl)methyl]-3-(trifluoromethyl)phenyl]-3-[4-[[6-(methylamino)-4-pyrimidinyl]oxy]phenyl]urea 1-[4-[(4-ethylpiperazino)methyl]-3-(trifluoromethyl)phenyl]-3-[4-[6-(methylamino)pyrimidin-4-yl]oxyphenyl]urea cid_11409972
Type:
Small organic molecule
Emp. Form.:
C26H30F3N7O2
Mol. Mass.:
529.5573
SMILES:
CCN1CCN(Cc2ccc(NC(=O)Nc3ccc(Oc4cc(NC)ncn4)cc3)cc2C(F)(F)F)CC1
: