Target
Mitogen-activated protein kinase 11
Ligand
BDBM16673
Substrate
Meas. Tech.
ChEMBL_586717 (CHEMBL1062864)
Kd
230±n/a nM
Citation
 Karaman, MWHerrgard, STreiber, DKGallant, PAtteridge, CECampbell, BTChan, KWCiceri, PDavis, MIEdeen, PTFaraoni, RFloyd, MHunt, JPLockhart, DJMilanov, ZVMorrison, MJPallares, GPatel, HKPritchard, SWodicka, LMZarrinkar, PP A quantitative analysis of kinase inhibitor selectivity. Nat Biotechnol 26:127-32 (2008)  
Target
Name:
Mitogen-activated protein kinase 11
Synonyms:
MAP kinase p38 MK11_HUMAN Mitogen-activated protein kinase p38 beta SAPK2 Stress-activated protein kinase 2 p38-2 p38b
Type:
Enzyme Catalytic Domain
Mol. Mass.:
41351.73
Organism:
Homo sapiens (Human)
Description:
gi_20128774
Residue:
364
  
Inhibitor
Name:
BDBM16673
Synonyms:
4-[4-({[4-chloro-3-(trifluoromethyl)phenyl]carbamoyl}amino)phenoxy]-N-methylpyridine-2-carboxamide BAY 43-9006 BAY439006 Hit compound, 8 Sorafenib US10183928, Sorafenib US10227329, Compound Sorafenib US10774070, Compound Sorafenib US11279688, Compound Sorafenib US9029401, Sorafenib US9902709, Comparative example 1 cid_216239
Type:
Small organic molecule
Emp. Form.:
C21H16ClF3N4O3
Mol. Mass.:
464.825
SMILES:
CNC(=O)c1cc(Oc2ccc(NC(=O)Nc3ccc(Cl)c(c3)C(F)(F)F)cc2)ccn1
: