Target
Serine/threonine-protein kinase DCLK2
Ligand
BDBM5445
Substrate
Meas. Tech.
ChEMBL_586817 (CHEMBL1063795)
Kd
>10000±n/a nM
Citation
 Karaman, MWHerrgard, STreiber, DKGallant, PAtteridge, CECampbell, BTChan, KWCiceri, PDavis, MIEdeen, PTFaraoni, RFloyd, MHunt, JPLockhart, DJMilanov, ZVMorrison, MJPallares, GPatel, HKPritchard, SWodicka, LMZarrinkar, PP A quantitative analysis of kinase inhibitor selectivity. Nat Biotechnol 26:127-32 (2008)  
Target
Name:
Serine/threonine-protein kinase DCLK2
Synonyms:
DCAMKL2 DCK2 DCLK2_HUMAN | Serine/threonine-protein kinase DCLK2
Type:
PROTEIN
Mol. Mass.:
83621.38
Organism:
Homo sapiens (Human)
Description:
ChEMBL_586817
Residue:
766
  
Inhibitor
Name:
BDBM5445
Synonyms:
CHEMBL554 LAPATINIB DITOSYLATE N-{3-chloro-4-[(3-fluoro-benzyl)oxy]phenyl}-6-[5-({2-(methylsulfonyl)ethyl]amino}methyl)-2-furyl]-4-quinazolinamine Tykerb US10822334, Compound Lapatinib cid_208908
Type:
Small organic molecule
Emp. Form.:
C29H26ClFN4O4S
Mol. Mass.:
581.058
SMILES:
CS(=O)(=O)CCNCc1ccc(o1)-c1ccc2ncnc(Nc3ccc(OCc4cccc(F)c4)c(Cl)c3)c2c1
: