Target
Cyclin-dependent kinase 11B
Ligand
BDBM31085
Substrate
Meas. Tech.
ChEMBL_586561 (CHEMBL1060184)
Kd
1400±n/a nM
Citation
 Karaman, MWHerrgard, STreiber, DKGallant, PAtteridge, CECampbell, BTChan, KWCiceri, PDavis, MIEdeen, PTFaraoni, RFloyd, MHunt, JPLockhart, DJMilanov, ZVMorrison, MJPallares, GPatel, HKPritchard, SWodicka, LMZarrinkar, PP A quantitative analysis of kinase inhibitor selectivity. Nat Biotechnol 26:127-32 (2008)  
Target
Name:
Cyclin-dependent kinase 11B
Synonyms:
2.7.11.22 CDC2L1 CDK11B Cell division cycle 2-like protein kinase 1 Cyclin-dependent kinase Cyclin-dependent kinase 11B PITSLRE serine/threonine-protein kinase CDC2L1 PK58 | p58 CLK-1
Type:
Protein
Mol. Mass.:
92685.77
Organism:
Homo sapiens (Human)
Description:
P21127
Residue:
795
  
Inhibitor
Name:
BDBM31085
Synonyms:
1-[4-[(4-ethyl-1-piperazinyl)methyl]-3-(trifluoromethyl)phenyl]-3-[4-[[6-(methylamino)-4-pyrimidinyl]oxy]phenyl]urea 1-[4-[(4-ethylpiperazino)methyl]-3-(trifluoromethyl)phenyl]-3-[4-[6-(methylamino)pyrimidin-4-yl]oxyphenyl]urea cid_11409972
Type:
Small organic molecule
Emp. Form.:
C26H30F3N7O2
Mol. Mass.:
529.5573
SMILES:
CCN1CCN(Cc2ccc(NC(=O)Nc3ccc(Oc4cc(NC)ncn4)cc3)cc2C(F)(F)F)CC1
: