Target
Vasopressin V1b receptor
Ligand
BDBM50299350
Substrate
Meas. Tech.
ChEMBL_590267 (CHEMBL1052802)
Ki
96±n/a nM
Citation
 Scott, JDMiller, MWLi, SWLin, SIVaccaro, HAHong, LMullins, DEGuzzi, MWeinstein, JHodgson, RAVarty, GBStamford, AWChan, TYMcKittrick, BAGreenlee, WJPriestley, TParker, EM Tetrahydroquinoline sulfonamides as vasopressin 1b receptor antagonists. Bioorg Med Chem Lett 19:6018-22 (2009)  
Target
Name:
Vasopressin V1b receptor
Synonyms:
AVPR V1b AVPR1B Antidiuretic hormone receptor 1b V1bR VPR3 Vasopressin V1b receptor (V1b) Vasopressin V3 receptor
Type:
Enzyme
Mol. Mass.:
46985.01
Organism:
Homo sapiens (Human)
Description:
P47901
Residue:
424
  
Inhibitor
Name:
BDBM50299350
Synonyms:
1-(2-(1-(2,4-dimethoxyphenylsulfonyl)-1,2,3,4-tetrahydroquinolin-2-yl)ethylsulfonyl)-N-(thiophen-3-ylmethyl)piperidin-4-amine | CHEMBL583082
Type:
Small organic molecule
Emp. Form.:
C29H37N3O6S3
Mol. Mass.:
619.816
SMILES:
COc1ccc(c(OC)c1)S(=O)(=O)N1C(CCS(=O)(=O)N2CCC(CC2)NCc2ccsc2)CCc2ccccc12
: