Target
Vasopressin V1b receptor
Ligand
BDBM50299354
Substrate
Meas. Tech.
ChEMBL_590268 (CHEMBL1052803)
Ki
270±n/a nM
Citation
 Scott, JDMiller, MWLi, SWLin, SIVaccaro, HAHong, LMullins, DEGuzzi, MWeinstein, JHodgson, RAVarty, GBStamford, AWChan, TYMcKittrick, BAGreenlee, WJPriestley, TParker, EM Tetrahydroquinoline sulfonamides as vasopressin 1b receptor antagonists. Bioorg Med Chem Lett 19:6018-22 (2009)  
Target
Name:
Vasopressin V1b receptor
Synonyms:
Avpr1b VASOPRESSIN V1B Vasopressin receptor
Type:
Enzyme Catalytic Domain
Mol. Mass.:
47104.48
Organism:
RAT
Description:
VASOPRESSIN V1B AVPR1B RAT::P48974
Residue:
425
  
Inhibitor
Name:
BDBM50299354
Synonyms:
1-(2-(1-(2,4-dimethoxyphenylsulfonyl)-1,2,3,4-tetrahydroquinolin-2-yl)ethylsulfonyl)-N-(3-methoxybenzyl)piperidin-4-amine | CHEMBL572983
Type:
Small organic molecule
Emp. Form.:
C32H41N3O7S2
Mol. Mass.:
643.814
SMILES:
COc1cccc(CNC2CCN(CC2)S(=O)(=O)CCC2CCc3ccccc3N2S(=O)(=O)c2ccc(OC)cc2OC)c1
: