Target
Vasopressin V1a receptor
Ligand
BDBM50299354
Substrate
Meas. Tech.
ChEMBL_590269 (CHEMBL1052804)
Ki
2600±n/a nM
Citation
 Scott, JDMiller, MWLi, SWLin, SIVaccaro, HAHong, LMullins, DEGuzzi, MWeinstein, JHodgson, RAVarty, GBStamford, AWChan, TYMcKittrick, BAGreenlee, WJPriestley, TParker, EM Tetrahydroquinoline sulfonamides as vasopressin 1b receptor antagonists. Bioorg Med Chem Lett 19:6018-22 (2009)  
Target
Name:
Vasopressin V1a receptor
Synonyms:
AVPR V1a AVPR1A V1AR_HUMAN VASOPRESSIN V1A Vasopressin V1 receptor Vasopressin receptor
Type:
Receptor
Mol. Mass.:
46820.18
Organism:
Homo sapiens (Human)
Description:
P37288
Residue:
418
  
Inhibitor
Name:
BDBM50299354
Synonyms:
1-(2-(1-(2,4-dimethoxyphenylsulfonyl)-1,2,3,4-tetrahydroquinolin-2-yl)ethylsulfonyl)-N-(3-methoxybenzyl)piperidin-4-amine | CHEMBL572983
Type:
Small organic molecule
Emp. Form.:
C32H41N3O7S2
Mol. Mass.:
643.814
SMILES:
COc1cccc(CNC2CCN(CC2)S(=O)(=O)CCC2CCc3ccccc3N2S(=O)(=O)c2ccc(OC)cc2OC)c1
: