Target
Vasopressin V1b receptor
Ligand
BDBM50299341
Substrate
Meas. Tech.
ChEMBL_590268 (CHEMBL1052803)
Ki
56±n/a nM
Citation
 Scott, JDMiller, MWLi, SWLin, SIVaccaro, HAHong, LMullins, DEGuzzi, MWeinstein, JHodgson, RAVarty, GBStamford, AWChan, TYMcKittrick, BAGreenlee, WJPriestley, TParker, EM Tetrahydroquinoline sulfonamides as vasopressin 1b receptor antagonists. Bioorg Med Chem Lett 19:6018-22 (2009)  
Target
Name:
Vasopressin V1b receptor
Synonyms:
Avpr1b VASOPRESSIN V1B Vasopressin receptor
Type:
Enzyme Catalytic Domain
Mol. Mass.:
47104.48
Organism:
RAT
Description:
VASOPRESSIN V1B AVPR1B RAT::P48974
Residue:
425
  
Inhibitor
Name:
BDBM50299341
Synonyms:
1-(2-(1-(2,4-dimethoxyphenylsulfonyl)-1,2,3,4-tetrahydroquinolin-2-yl)ethylsulfonyl)-N-((tetrahydro-2H-pyran-4-yl)methyl)piperidin-4-amine | CHEMBL572754
Type:
Small organic molecule
Emp. Form.:
C30H43N3O7S2
Mol. Mass.:
621.808
SMILES:
COc1ccc(c(OC)c1)S(=O)(=O)N1C(CCS(=O)(=O)N2CCC(CC2)NCC2CCOCC2)CCc2ccccc12
: