Target
Legumain
Ligand
BDBM50378268
Substrate
Meas. Tech.
ChEMBL_589116 (CHEMBL1038469)
IC50
2.6±n/a nM
Citation
 Ovat, AMuindi, FFagan, CBrouner, MHansell, EDvorák, JSojka, DKopácek, PMcKerrow, JHCaffrey, CRPowers, JC Aza-peptidyl Michael acceptor and epoxide inhibitors--potent and selective inhibitors of Schistosoma mansoni and Ixodes ricinus legumains (asparaginyl endopeptidases). J Med Chem 52:7192-210 (2009)  
Target
Name:
Legumain
Synonyms:
Asparaginyl Endopeptidase (AE) | Legumain-like protease precursor
Type:
Enzyme
Mol. Mass.:
49038.15
Organism:
Ixodes ricinus
Description:
IrAE was expressed and produced in Pichia pastoris.
Residue:
441
  
Inhibitor
Name:
BDBM50378268
Synonyms:
CHEMBL573433
Type:
Small organic molecule
Emp. Form.:
C39H44N8O6
Mol. Mass.:
720.8167
SMILES:
C[C@H](NC(=O)[C@@H](C)NC(=O)N1CCNCC1)C(=O)NN(CC(N)=O)C(=O)C=CC(=O)N(Cc1cccc2ccccc12)Cc1cccc2ccccc12
: