Target
Synaptic vesicular amine transporter
Ligand
BDBM50300436
Substrate
Meas. Tech.
ChEMBL_591960 (CHEMBL1047523)
Ki
1330±n/a nM
Citation
 Vartak, APNickell, JRChagkutip, JDwoskin, LPCrooks, PA Pyrrolidine analogues of lobelane: relationship of affinity for the dihydrotetrabenazine binding site with function of the vesicular monoamine transporter 2 (VMAT2). J Med Chem 52:7878-82 (2009)  
Target
Name:
Synaptic vesicular amine transporter
Synonyms:
Monoamine transporter Solute carrier family 18 member 2 Synaptic vesicular amine transporter VMAT2_RAT Vesicular monoamine transporter 2 (VMAT2) | Vmat2
Type:
Protein
Mol. Mass.:
55689.58
Organism:
Rattus norvegicus (Rat)
Description:
Q01827
Residue:
515
  
Inhibitor
Name:
BDBM50300436
Synonyms:
(2S,5S)-di-(2-phenethyl)-pyrrolidine | CHEMBL573040
Type:
Small organic molecule
Emp. Form.:
C20H25N
Mol. Mass.:
279.4192
SMILES:
C(Cc1ccccc1)[C@H]1CC[C@H](CCc2ccccc2)N1
: