Target
Beta-carbonic anhydrase 1
Ligand
BDBM33266
Substrate
Meas. Tech.
ChEMBL_599731 (CHEMBL1048175)
Ki
9270±n/a nM
Citation
 Maresca, ACarta, FVullo, DScozzafava, ASupuran, CT Carbonic anhydrase inhibitors. Inhibition of the Rv1284 and Rv3273 beta-carbonic anhydrases from Mycobacterium tuberculosis with diazenylbenzenesulfonamides. Bioorg Med Chem Lett 19:4929-32 (2009)  
Target
Name:
Beta-carbonic anhydrase 1
Synonyms:
β-Carbonic anhydrase 1 (CA 1) MTCA1_MYCTU canA | mtcA1
Type:
Enzyme
Mol. Mass.:
18186.06
Organism:
Mycobacterium tuberculosis
Description:
The recombinant GST-mtCA1 construct was cloned, expressed, and further purified from E. coli. The purified protein was used in inhibition assays.
Residue:
163
  
Inhibitor
Name:
BDBM33266
Synonyms:
CHEMBL379206 p-Phenyldiazenyl derivative, 5
Type:
Small organic molecule
Emp. Form.:
C12H11N3O3S
Mol. Mass.:
277.299
SMILES:
NS(=O)(=O)c1ccc(cc1)N=Nc1ccc(O)cc1
: