Target
Vasopressin V1a receptor
Ligand
BDBM50307117
Substrate
Meas. Tech.
ChEMBL_609618 (CHEMBL1065233)
Ki
2.74±n/a nM
Citation
 Frantz, MCRodrigo, JBoudier, LDurroux, TMouillac, BHibert, M Subtlety of the structure-affinity and structure-efficacy relationships around a nonpeptide oxytocin receptor agonist. J Med Chem 53:1546-62 (2010)  
Target
Name:
Vasopressin V1a receptor
Synonyms:
AVPR V1a AVPR1A V1AR_HUMAN VASOPRESSIN V1A Vasopressin V1 receptor Vasopressin receptor
Type:
Receptor
Mol. Mass.:
46820.18
Organism:
Homo sapiens (Human)
Description:
P37288
Residue:
418
  
Inhibitor
Name:
BDBM50307117
Synonyms:
CHEMBL603708 | N-(4-(2,3,4,5-tetrahydro-1H-benzo[b]azepine-1-carbonyl)phenyl)biphenyl-2-carboxamide
Type:
Small organic molecule
Emp. Form.:
C30H26N2O2
Mol. Mass.:
446.5396
SMILES:
O=C(Nc1ccc(cc1)C(=O)N1CCCCc2ccccc12)c1ccccc1-c1ccccc1
: