Target
Galanin receptor type 1
Ligand
BDBM50307250
Substrate
Meas. Tech.
ChEMBL_610349 (CHEMBL1072081)
Ki
3.5±n/a nM
Citation
 Robertson, CRScholl, EAPruess, THGreen, BRWhite, HSBulaj, G Engineering galanin analogues that discriminate between GalR1 and GalR2 receptor subtypes and exhibit anticonvulsant activity following systemic delivery. J Med Chem 53:1871-5 (2010)  
Target
Name:
Galanin receptor type 1
Synonyms:
GAL1-R GALNR1 GALR1_HUMAN Galanin receptor 1 | Galanin receptor type 1
Type:
Enzyme Catalytic Domain
Mol. Mass.:
38976.60
Organism:
Homo sapiens (Human)
Description:
Galanin R1 GALR1 HUMAN::P47211
Residue:
349
  
Inhibitor
Name:
BDBM50307250
Synonyms:
CHEMBL578514 | GalB2
Type:
Small organic molecule
Emp. Form.:
C104H173N23O23
Mol. Mass.:
2113.6267
SMILES:
CCCCCCCCCCCCCCCC(=O)NCCCC[C@H](NC(=O)[C@H](CCCCN)NC(=O)[C@H](CCCCN)NC(=O)[C@@H]1CCCN1C(=O)CNC(=O)[C@H](CC(C)C)NC(=O)[C@H](CC(C)C)NC(=O)[C@H](Cc1ccc(O)cc1)NC(=O)CNC(=O)[C@H](C)NC(=O)[C@H](CO)NC(=O)[C@H](CC(N)=O)NC(=O)[C@H](CC(C)C)NC(=O)[C@@H](NC(=O)[C@H](Cc1c[nH]c2ccccc12)NC(=O)CNC)[C@@H](C)O)C(=O)N[C@@H](CCCCN)C(O)=O
: