Target
5-hydroxytryptamine receptor 1A
Ligand
BDBM50241119
Substrate
Meas. Tech.
ChEMBL_608753 (CHEMBL1067766)
Ki
9.3±n/a nM
Citation
 Neves, GMenegatti, RAntonio, CBGrazziottin, LRVieira, RORates, SMNoël, FBarreiro, EJFraga, CA Searching for multi-target antipsychotics: Discovery of orally active heterocyclic N-phenylpiperazine ligands of D2-like and 5-HT1A receptors. Bioorg Med Chem 18:1925-35 (2010)  
Target
Name:
5-hydroxytryptamine receptor 1A
Synonyms:
5-HT-1A 5-hydroxytryptamine receptor 1A (5-HT-1A) ADRB2RL1 Dopamine D2 receptor and serotonin 1a receptor HTR1A | Serotonin receptor 1A
Type:
Mol. Mass.:
46122.49
Organism:
Homo sapiens (Human)
Description:
Residue:
422
  
Inhibitor
Name:
BDBM50241119
Synonyms:
7-(4-Biphenyl-3-ylmethyl-piperazin-1-yl)-3H-benzooxazol-2-one CHEMBL218166
Type:
Small organic molecule
Emp. Form.:
C24H23N3O2
Mol. Mass.:
385.4583
SMILES:
O=c1[nH]c2cccc(N3CCN(Cc4cccc(c4)-c4ccccc4)CC3)c2o1
: