Target
Serine/threonine-protein kinase PLK1
Ligand
BDBM50308188
Substrate
Meas. Tech.
ChEMBL_613679 (CHEMBL1067599)
IC50
5700±n/a nM
Citation
 Egert-Schmidt, AMDreher, JDunkel, UKohfeld, SPreu, LWeber, HEhlert, JEMutschler, BTotzke, FSchächtele, CKubbutat, MHBaumann, KKunick, C Identification of 2-anilino-9-methoxy-5,7-dihydro-6H-pyrimido[5,4-d][1]benzazepin-6-ones as dual PLK1/VEGF-R2 kinase inhibitor chemotypes by structure-based lead generation. J Med Chem 53:2433-42 (2010)  
Target
Name:
Serine/threonine-protein kinase PLK1
Synonyms:
PLK PLK1 Polo-like kinase 1 (PlK1) STPK13 Serine/threonine-protein kinase 13 | polo-like kinase
Type:
Serine/threonine-protein kinase
Mol. Mass.:
68277.16
Organism:
Homo sapiens (Human)
Description:
P53350
Residue:
603
  
Inhibitor
Name:
BDBM50308188
Synonyms:
2-(3-Hydroxy-4-methoxyanilino)-5,7-dihydro-6H-pyrimido[5,4-d]-[1]benzazepin-6-one | CHEMBL603463
Type:
Small organic molecule
Emp. Form.:
C19H16N4O3
Mol. Mass.:
348.3553
SMILES:
COc1ccc(Nc2ncc3CC(=O)Nc4ccccc4-c3n2)cc1O
: