Target
Vascular endothelial growth factor receptor 2
Ligand
BDBM50308188
Substrate
Meas. Tech.
ChEMBL_613684 (CHEMBL1070927)
IC50
2400±n/a nM
Citation
 Egert-Schmidt, AMDreher, JDunkel, UKohfeld, SPreu, LWeber, HEhlert, JEMutschler, BTotzke, FSchächtele, CKubbutat, MHBaumann, KKunick, C Identification of 2-anilino-9-methoxy-5,7-dihydro-6H-pyrimido[5,4-d][1]benzazepin-6-ones as dual PLK1/VEGF-R2 kinase inhibitor chemotypes by structure-based lead generation. J Med Chem 53:2433-42 (2010)  
Target
Name:
Vascular endothelial growth factor receptor 2
Synonyms:
CD_antigen=CD309 Fetal liver kinase 1 (FLK-1) KDR Protein-tyrosine kinase receptor Flk-1 VEGFR-2 VEGFR2 Vascular Endothelial Growth Factor Receptor Kinase 2 Vascular endothelial growth factor receptor 2 (KDR) Vascular endothelial growth factor receptor 2 (VEGFR2) Vascular endothelial growth factor receptor-2 (VEGFR-2)
Type:
Receptor Tyrosine Kinase
Mol. Mass.:
151510.97
Organism:
Homo sapiens (Human)
Description:
P35968
Residue:
1356
  
Inhibitor
Name:
BDBM50308188
Synonyms:
2-(3-Hydroxy-4-methoxyanilino)-5,7-dihydro-6H-pyrimido[5,4-d]-[1]benzazepin-6-one | CHEMBL603463
Type:
Small organic molecule
Emp. Form.:
C19H16N4O3
Mol. Mass.:
348.3553
SMILES:
COc1ccc(Nc2ncc3CC(=O)Nc4ccccc4-c3n2)cc1O
: