Target
Vascular endothelial growth factor receptor 2
Ligand
BDBM50308208
Substrate
Meas. Tech.
ChEMBL_613676 (CHEMBL1067596)
IC50
630±n/a nM
Citation
 Egert-Schmidt, AMDreher, JDunkel, UKohfeld, SPreu, LWeber, HEhlert, JEMutschler, BTotzke, FSchächtele, CKubbutat, MHBaumann, KKunick, C Identification of 2-anilino-9-methoxy-5,7-dihydro-6H-pyrimido[5,4-d][1]benzazepin-6-ones as dual PLK1/VEGF-R2 kinase inhibitor chemotypes by structure-based lead generation. J Med Chem 53:2433-42 (2010)  
Target
Name:
Vascular endothelial growth factor receptor 2
Synonyms:
CD_antigen=CD309 Fetal liver kinase 1 (FLK-1) KDR Protein-tyrosine kinase receptor Flk-1 VEGFR-2 VEGFR2 Vascular Endothelial Growth Factor Receptor Kinase 2 Vascular endothelial growth factor receptor 2 (KDR) Vascular endothelial growth factor receptor 2 (VEGFR2) Vascular endothelial growth factor receptor-2 (VEGFR-2)
Type:
Receptor Tyrosine Kinase
Mol. Mass.:
151510.97
Organism:
Homo sapiens (Human)
Description:
P35968
Residue:
1356
  
Inhibitor
Name:
BDBM50308208
Synonyms:
2-Phenyl-6,8-dihydro-7H-pyrazolo[5',1':2,3]pyrimido[5,4-d][1]benzazepin-7-one | CHEMBL599247
Type:
Small organic molecule
Emp. Form.:
C20H14N4O
Mol. Mass.:
326.3514
SMILES:
O=C1Cc2cnc3cc(nn3c2-c2ccccc2N1)-c1ccccc1
: