Target
Mitogen-activated protein kinase 14
Ligand
BDBM14771
Substrate
Meas. Tech.
ChEMBL_613377 (CHEMBL1067575)
IC50
960±n/a nM
Citation
 Ehrman, TMBarlow, DJHylands, PJ In silico search for multi-target anti-inflammatories in Chinese herbs and formulas. Bioorg Med Chem 18:2204-18 (2010)  
Target
Name:
Mitogen-activated protein kinase 14
Synonyms:
CSAID-binding protein CSBP1 CSPB1 MAP kinase 14 MAP kinase p38 alpha MAPK14 MK14_HUMAN Mitogen-activated protein kinase p38 alpha Stress-activated protein kinase 2a | p38 MAP kinase alpha/beta
Type:
Serine/threonine-protein kinase
Mol. Mass.:
41286.76
Organism:
Homo sapiens (Human)
Description:
Q16539
Residue:
360
  
Inhibitor
Name:
BDBM14771
Synonyms:
(E)-{1-[3-(cyclopentyloxy)-4-methoxyphenyl]ethylidene}amino carbamate [1-(3-cyclopentyloxy-4-methoxy-phenyl)ethylideneamino] carbamate
Type:
Small organic molecule
Emp. Form.:
C15H20N2O4
Mol. Mass.:
292.3303
SMILES:
COc1ccc(cc1OC1CCCC1)C(C)=NOC(N)=O
: