Target
Protein kinase C epsilon type
Ligand
BDBM14027
Substrate
Meas. Tech.
ChEMBL_607695 (CHEMBL1066160)
IC50
3000±n/a nM
Citation
 Morwick, TBüttner, FHCywin, CLDahmann, GHickey, EJakes, SKaplita, PKashem, MAKerr, SKugler, SMao, WMarshall, DPaw, ZShih, CKWu, FYoung, E Hit to lead account of the discovery of bisbenzamide and related ureidobenzamide inhibitors of Rho kinase. J Med Chem 53:759-77 (2010)  
Target
Name:
Protein kinase C epsilon type
Synonyms:
KPCE_HUMAN PKCE Protein kinase C epsilon Protein kinase C, PKC; classical/novel nPKC-epsilon
Type:
Enzyme
Mol. Mass.:
83680.45
Organism:
Homo sapiens (Human)
Description:
The recombinant human PKC enzymes were produced using a baculovirus expression system in SF9 cells
Residue:
737
  
Inhibitor
Name:
BDBM14027
Synonyms:
5-(1,4-diazepan-1-ylsulfonyl)isoquinoline AT877 CHEMBL541388 HA-1077 cid_163751
Type:
Small organic molecule
Emp. Form.:
C14H17N3O2S
Mol. Mass.:
291.369
SMILES:
O=S(=O)(N1CCCNCC1)c1cccc2cnccc12
: