Target
Kinesin-like protein KIF11
Ligand
BDBM50313390
Substrate
Meas. Tech.
ChEMBL_617338 (CHEMBL1101849)
IC50
300±n/a nM
Citation
 Schiemann, KFinsinger, DZenke, FAmendt, CKnöchel, TBruge, DBuchstaller, HPEmde, UStähle, WAnzali, S The discovery and optimization of hexahydro-2H-pyrano[3,2-c]quinolines (HHPQs) as potent and selective inhibitors of the mitotic kinesin-5. Bioorg Med Chem Lett 20:1491-5 (2010)  
Target
Name:
Kinesin-like protein KIF11
Synonyms:
EG5 KIF11_HUMAN Kinesin Spindle Protein Eg5 TRIP5 | kinesin spindle protein
Type:
PROTEIN
Mol. Mass.:
119138.97
Organism:
Homo sapiens (Human)
Description:
ChEMBL_1457426
Residue:
1056
  
Inhibitor
Name:
BDBM50313390
Synonyms:
(4aS,5R,10bS)-9-tert-butyl-5-phenyl-3,4,4a,5,6,10b-hexahydro-2H-pyrano[3,2-c]quinoline | CHEMBL1089056
Type:
Small organic molecule
Emp. Form.:
C22H27NO
Mol. Mass.:
321.4559
SMILES:
CC(C)(C)c1ccc2N[C@H]([C@@H]3CCCO[C@@H]3c2c1)c1ccccc1
: