Target
Vascular endothelial growth factor receptor 2
Ligand
BDBM50236362
Substrate
Meas. Tech.
ChEMBL_627200 (CHEMBL1114554)
IC50
0.480000±n/a nM
Citation
 Zuccotto, FArdini, ECasale, EAngiolini, M Through the"gatekeeper door": exploiting the active kinase conformation. J Med Chem 53:2681-94 (2010)  
Target
Name:
Vascular endothelial growth factor receptor 2
Synonyms:
CD_antigen=CD309 Fetal liver kinase 1 (FLK-1) KDR Protein-tyrosine kinase receptor Flk-1 VEGFR-2 VEGFR2 Vascular Endothelial Growth Factor Receptor Kinase 2 Vascular endothelial growth factor receptor 2 (KDR) Vascular endothelial growth factor receptor 2 (VEGFR2) Vascular endothelial growth factor receptor-2 (VEGFR-2)
Type:
Receptor Tyrosine Kinase
Mol. Mass.:
151510.97
Organism:
Homo sapiens (Human)
Description:
P35968
Residue:
1356
  
Inhibitor
Name:
BDBM50236362
Synonyms:
CHEMBL429743 N-(4-chlorophenyl)-6-[(6,7-dimethoxyquinolin-4-yl)oxy]naphthalene-1-carboxamide
Type:
Small organic molecule
Emp. Form.:
C28H21ClN2O4
Mol. Mass.:
484.93
SMILES:
COc1cc2nccc(Oc3ccc4c(cccc4c3)C(=O)Nc3ccc(Cl)cc3)c2cc1OC
: