Target
Metabotropic glutamate receptor 8
Ligand
BDBM50314803
Substrate
Meas. Tech.
ChEMBL_627229 (CHEMBL1110798)
EC50
73000±n/a nM
Citation
 Selvam, COueslati, NLemasson, IABrabet, IRigault, DCourtiol, TCesarini, STriballeau, NBertrand, HOGoudet, CPin, JPAcher, FC A virtual screening hit reveals new possibilities for developing group III metabotropic glutamate receptor agonists. J Med Chem 53:2797-813 (2010)  
Target
Name:
Metabotropic glutamate receptor 8
Synonyms:
GRM8_RAT Grm8 Metabotropic glutamate receptor 8 (mGlu8) glutamate receptor, metabotropic 8 precursor metabotropic glutamate 8
Type:
Enzyme
Mol. Mass.:
101886.18
Organism:
Rattus norvegicus (Rat)
Description:
P70579
Residue:
908
  
Inhibitor
Name:
BDBM50314803
Synonyms:
(2S)-2-Amino-5-[(hydroxy)phosphinyl]pentanoic Acid | CHEMBL1089174
Type:
Small organic molecule
Emp. Form.:
C5H12NO4P
Mol. Mass.:
181.1268
SMILES:
N[C@@H](CCCP(O)=O)C(O)=O
: