Target
Metabotropic glutamate receptor 4
Ligand
BDBM50314803
Substrate
Meas. Tech.
ChEMBL_627218 (CHEMBL1115329)
EC50
209000±n/a nM
Citation
 Selvam, COueslati, NLemasson, IABrabet, IRigault, DCourtiol, TCesarini, STriballeau, NBertrand, HOGoudet, CPin, JPAcher, FC A virtual screening hit reveals new possibilities for developing group III metabotropic glutamate receptor agonists. J Med Chem 53:2797-813 (2010)  
Target
Name:
Metabotropic glutamate receptor 4
Synonyms:
GRM4_RAT Grm4 Metabotropic glutamate receptor 4 (mGlu4) mGlu4 metabotropic glutamate 4a
Type:
Enzyme
Mol. Mass.:
101849.79
Organism:
Rattus norvegicus (Rat)
Description:
P31423
Residue:
912
  
Inhibitor
Name:
BDBM50314803
Synonyms:
(2S)-2-Amino-5-[(hydroxy)phosphinyl]pentanoic Acid | CHEMBL1089174
Type:
Small organic molecule
Emp. Form.:
C5H12NO4P
Mol. Mass.:
181.1268
SMILES:
N[C@@H](CCCP(O)=O)C(O)=O
: