Target
Potassium voltage-gated channel subfamily H member 2
Ligand
BDBM50315675
Substrate
Meas. Tech.
ChEMBL_624022 (CHEMBL1116908)
Ki
4.7±n/a nM
Citation
 Lansdell, MIHepworth, DCalabrese, ABrown, ADBlagg, JBurring, DJWilson, PFradet, DBrown, TBQuinton, FMistry, NTang, KMount, NStacey, PEdmunds, NAdams, CGaboardi, SNeal-Morgan, SWayman, CCole, SPhipps, JLewis, MVerrier, HGillon, VFeeder, NHeatherington, ASultana, SHaughie, SMartin, SWSudworth, MTweedy, S Discovery of a selective small-molecule melanocortin-4 receptor agonist with efficacy in a pilot study of sexual dysfunction in humans. J Med Chem 53:3183-97 (2010)  
Target
Name:
Potassium voltage-gated channel subfamily H member 2
Synonyms:
1,3-beta-glucan synthase component GLS2 ERG Eag-related protein 1 Ether-a-go-go-related gene (HERG) Ether-a-go-go-related gene potassium channel 1 Ether-a-go-go-related gene potassium channel 1 (hERG1) Ether-a-go-go-related protein 1 H-ERG KCNH2 Potassium voltage-gated channel subfamily H member 2 (hERG) Voltage-gated potassium channel subunit Kv11.1 hERG Potassium Channel 1 | putative potassium channel subunit
Type:
Multi-pass membrane protein
Mol. Mass.:
126672.65
Organism:
Homo sapiens (Human)
Description:
Q12809
Residue:
1159
  
Inhibitor
Name:
BDBM50315675
Synonyms:
((3R,4S)-4-(2,4-difluorophenyl)-1-(pyridin-2-yl)pyrrolidin-3-yl)((3S,4S,5R)-4-hydroxy-3,5-dimethyl-4-phenylpiperidin-1-yl)methanone | CHEMBL1089103
Type:
Small organic molecule
Emp. Form.:
C29H31F2N3O2
Mol. Mass.:
491.5721
SMILES:
C[C@H]1CN(C[C@@H](C)[C@]1(O)c1ccccc1)C(=O)[C@H]1CN(C[C@@H]1c1ccc(F)cc1F)c1ccccn1
: