Target
Glucocorticoid receptor
Ligand
BDBM50316569
Substrate
Meas. Tech.
ChEMBL_631258 (CHEMBL1114665)
IC50
59±n/a nM
Citation
 Bai, MCarr, GDeorazio, RJFriedrich, TDDobritsa, SFitzpatrick, KGuzzo, PRKitchen, DBLynch, MAPeace, DSajad, MUsyatinsky, AWolf, MA 5-Functionalized indazoles as glucocorticoid receptor agonists. Bioorg Med Chem Lett 20:3017-20 (2010)  
Target
Name:
Glucocorticoid receptor
Synonyms:
GCR_HUMAN GRL Glucocorticoid receptor (GRFP) Nuclear receptor subfamily 3 group C member 1
Type:
Enzyme
Mol. Mass.:
85656.87
Organism:
Homo sapiens (Human)
Description:
P04150
Residue:
777
  
Inhibitor
Name:
BDBM50316569
Synonyms:
2,2,2-trifluoro-1-(4-fluoro-3-methylphenyl)-1-(1-(4-fluorophenyl)-1H-indazol-5-yl)ethanol | CHEMBL1094514
Type:
Small organic molecule
Emp. Form.:
C22H15F5N2O
Mol. Mass.:
418.3593
SMILES:
Cc1cc(ccc1F)C(O)(c1ccc2n(ncc2c1)-c1ccc(F)cc1)C(F)(F)F
: