Target
5-hydroxytryptamine receptor 6
Ligand
BDBM50318624
Substrate
Meas. Tech.
ChEMBL_633199 (CHEMBL1118855)
Ki
0.256±n/a nM
Citation
 Ivachtchenko, AVDmitriev, DEGolovina, ESKadieva, MGKoryakova, AGKysil, VMMitkin, ODOkun, IMTkachenko, SEVorobiev, AA (3-Phenylsulfonylcycloalkano[e and d]pyrazolo[1,5-a]pyrimidin-2-yl)amines: potent and selective antagonists of the serotonin 5-HT6 receptor. J Med Chem 53:5186-96 (2010)  
Target
Name:
5-hydroxytryptamine receptor 6
Synonyms:
5-HT-6 5-hydroxytryptamine receptor 6 (5-HT-6) 5-hydroxytryptamine receptor 6 (5HT6) HTR6 Serotonin 6 (5-HT6) receptor | Serotonin Receptor 6
Type:
G Protein-Coupled Receptor (GPCR)
Mol. Mass.:
46968.43
Organism:
Homo sapiens (Human)
Description:
P50406
Residue:
440
  
Inhibitor
Name:
BDBM50318624
Synonyms:
CHEMBL1082762 | N,9-Dimethyl-3-(phenylsulfonyl)-5,6,7,8-tetrahydropyrazolo-[5,1-b]quinazolin-2-amine
Type:
Small organic molecule
Emp. Form.:
C18H20N4O2S
Mol. Mass.:
356.442
SMILES:
CNc1nn2c(C)c3CCCCc3nc2c1S(=O)(=O)c1ccccc1
: