Target
Neuronal acetylcholine receptor subunit alpha-7
Ligand
BDBM50321017
Substrate
Meas. Tech.
ChEMBL_639431 (CHEMBL1168404)
Ki
109000±n/a nM
Citation
 Dallanoce, CFrigerio, FMartelli, GGrazioso, GMatera, CPomè, DYPucci, LClementi, FGotti, CDe Amici, M Novel tricyclic Delta(2)-isoxazoline and 3-oxo-2-methyl-isoxazolidine derivatives: synthesis and binding affinity at neuronal nicotinic acetylcholine receptor subtypes. Bioorg Med Chem 18:4498-508 (2010)  
Target
Name:
Neuronal acetylcholine receptor subunit alpha-7
Synonyms:
ACHA7_RAT Cholinergic, Nicotinic Alpha7 Chrna7 Neuronal acetylcholine receptor (alpha7 nAChR) Neuronal acetylcholine receptor subunit alpha-7 Neuronal acetylcholine receptor subunit alpha-7 (nAChR)
Type:
Enzyme
Mol. Mass.:
56502.44
Organism:
Rattus norvegicus (Rat)
Description:
Q05941
Residue:
502
  
Inhibitor
Name:
BDBM50321017
Synonyms:
3-Bromo-5-oxa-4,11-diazatricyclo[6.2.1.0'2,6]undec-3-ene fumaric acid | CHEMBL1164404
Type:
Small organic molecule
Emp. Form.:
C8H11BrN2O
Mol. Mass.:
231.09
SMILES:
BrC1=NOC2CC3CCC(N3)C12
: