Target
Adenosine receptor A1
Ligand
BDBM50321538
Substrate
Meas. Tech.
ChEMBL_639628 (CHEMBL1175306)
Ki
30±n/a nM
Citation
 Cheung, AWBrinkman, JFirooznia, FFlohr, AGrimsby, JGubler, MLGuertin, KHamid, RMarcopulos, NNorcross, RDQi, LRamsey, GTan, JWen, YSarabu, R 4-Substituted-7-N-alkyl-N-acetyl 2-aminobenzothiazole amides: drug-like and non-xanthine based A2B adenosine receptor antagonists. Bioorg Med Chem Lett 20:4140-6 (2010)  
Target
Name:
Adenosine receptor A1
Synonyms:
A1 adenosine receptor (hA1) AA1R_HUMAN ADORA1 Adenosine A1-receptor Adenosine receptor A1 (hA1) | Adenosine transporter (AdT)
Type:
G Protein-Coupled Receptor (GPCR)
Mol. Mass.:
36520.92
Organism:
Homo sapiens (Human)
Description:
P30542
Residue:
326
  
Inhibitor
Name:
BDBM50321538
Synonyms:
CHEMBL1170130 | N-(4-chloro-7-(N-ethylacetamido)benzo[d]thiazol-2-yl)-4-fluorobenzamide
Type:
Small organic molecule
Emp. Form.:
C18H15ClFN3O2S
Mol. Mass.:
391.847
SMILES:
CCN(C(C)=O)c1ccc(Cl)c2nc(NC(=O)c3ccc(F)cc3)sc12
: