Target
Adenosine receptor A1
Ligand
BDBM50321553
Substrate
Meas. Tech.
ChEMBL_639628 (CHEMBL1175306)
Ki
50±n/a nM
Citation
 Cheung, AWBrinkman, JFirooznia, FFlohr, AGrimsby, JGubler, MLGuertin, KHamid, RMarcopulos, NNorcross, RDQi, LRamsey, GTan, JWen, YSarabu, R 4-Substituted-7-N-alkyl-N-acetyl 2-aminobenzothiazole amides: drug-like and non-xanthine based A2B adenosine receptor antagonists. Bioorg Med Chem Lett 20:4140-6 (2010)  
Target
Name:
Adenosine receptor A1
Synonyms:
A1 adenosine receptor (hA1) AA1R_HUMAN ADORA1 Adenosine A1-receptor Adenosine receptor A1 (hA1) | Adenosine transporter (AdT)
Type:
G Protein-Coupled Receptor (GPCR)
Mol. Mass.:
36520.92
Organism:
Homo sapiens (Human)
Description:
P30542
Residue:
326
  
Inhibitor
Name:
BDBM50321553
Synonyms:
CHEMBL1171200 | N-(7-(N-ethylacetamido)-4-methoxybenzo[d]thiazol-2-yl)-4-(pyrrolidine-1-carbonyl)benzamide
Type:
Small organic molecule
Emp. Form.:
C24H26N4O4S
Mol. Mass.:
466.553
SMILES:
CCN(C(C)=O)c1ccc(OC)c2nc(NC(=O)c3ccc(cc3)C(=O)N3CCCC3)sc12
: