Target
Adenosine receptor A2a
Ligand
BDBM50321542
Substrate
Meas. Tech.
ChEMBL_639629 (CHEMBL1175307)
Ki
46±n/a nM
Citation
 Cheung, AWBrinkman, JFirooznia, FFlohr, AGrimsby, JGubler, MLGuertin, KHamid, RMarcopulos, NNorcross, RDQi, LRamsey, GTan, JWen, YSarabu, R 4-Substituted-7-N-alkyl-N-acetyl 2-aminobenzothiazole amides: drug-like and non-xanthine based A2B adenosine receptor antagonists. Bioorg Med Chem Lett 20:4140-6 (2010)  
Target
Name:
Adenosine receptor A2a
Synonyms:
A2A adenosine receptor (hA2A) ADENOSINE A2 ADORA2 Adenosine A2A receptor (A2AAR)
Type:
G Protein-Coupled Receptor (GPCR)
Mol. Mass.:
44716.46
Organism:
Homo sapiens (Human)
Description:
P29274
Residue:
412
  
Inhibitor
Name:
BDBM50321542
Synonyms:
CHEMBL1170137 | N-(7-(N-ethylacetamido)-4-methoxybenzo[d]thiazol-2-yl)-4-(methylsulfonamido)benzamide
Type:
Small organic molecule
Emp. Form.:
C20H22N4O5S2
Mol. Mass.:
462.542
SMILES:
CCN(C(C)=O)c1ccc(OC)c2nc(NC(=O)c3ccc(NS(C)(=O)=O)cc3)sc12
: