Target
Adenosine receptor A2a
Ligand
BDBM50321523
Substrate
Meas. Tech.
ChEMBL_639629 (CHEMBL1175307)
Ki
3±n/a nM
Citation
 Cheung, AWBrinkman, JFirooznia, FFlohr, AGrimsby, JGubler, MLGuertin, KHamid, RMarcopulos, NNorcross, RDQi, LRamsey, GTan, JWen, YSarabu, R 4-Substituted-7-N-alkyl-N-acetyl 2-aminobenzothiazole amides: drug-like and non-xanthine based A2B adenosine receptor antagonists. Bioorg Med Chem Lett 20:4140-6 (2010)  
Target
Name:
Adenosine receptor A2a
Synonyms:
A2A adenosine receptor (hA2A) ADENOSINE A2 ADORA2 Adenosine A2A receptor (A2AAR)
Type:
G Protein-Coupled Receptor (GPCR)
Mol. Mass.:
44716.46
Organism:
Homo sapiens (Human)
Description:
P29274
Residue:
412
  
Inhibitor
Name:
BDBM50321523
Synonyms:
CHEMBL1171165 | N-(7-(N-ethylacetamido)-4-methoxybenzo[d]thiazol-2-yl)-1-(3-fluorobenzyl)-1H-pyrazole-4-carboxamide
Type:
Small organic molecule
Emp. Form.:
C23H22FN5O3S
Mol. Mass.:
467.516
SMILES:
CCN(C(C)=O)c1ccc(OC)c2nc(NC(=O)c3cnn(Cc4cccc(F)c4)c3)sc12
: