Target
Methionine aminopeptidase 1
Ligand
BDBM50180741
Substrate
Meas. Tech.
ChEMBL_639876 (CHEMBL1173891)
IC50
40100±n/a nM
Citation
 Altmeyer, MAMarschner, ASchiffmann, RKlein, CD Subtype-selectivity of metal-dependent methionine aminopeptidase inhibitors. Bioorg Med Chem Lett 20:4038-44 (2010)  
Target
Name:
Methionine aminopeptidase 1
Synonyms:
Aminopeptidase MAP 1 METAP1 Methionine Aminopeptidase Type 1 (MetAP1) | Peptidase M 1
Type:
Enzyme
Mol. Mass.:
43220.79
Organism:
Homo sapiens (Human)
Description:
MetAP1 with an N-terminal six histidine tag was expressed in baculovirus infected sf9 cells.
Residue:
386
  
Inhibitor
Name:
BDBM50180741
Synonyms:
2-(pyridin-2-yl)-1H-imidazo[4,5-b]pyrazine CHEMBL201143
Type:
Small organic molecule
Emp. Form.:
C10H7N5
Mol. Mass.:
197.1961
SMILES:
c1ccc(nc1)-c1nc2nccnc2[nH]1
: